{"text_format":"1","workbook":"xlsx","n_sheets":14,"sheets":["BasicData","WaterBalance","Workforce","IT","Training","CVKInvest","KfWProject","KfWInterest","BP","Assets","Tariffs","P&L","CashFlow","Graphs"],"not_rendered":{"charts":24,"images":0,"macros":1,"external_links":0,"defined_names":14,"comments":0,"pivot_tables":0},"unopened":[],"bounds":{"document_bytes":16777216,"sheet_cells":100000,"rows_first":2000,"rows_last":500,"rows_between":2000,"halvings":0,"cell_chars":16384,"cell_head_chars":4096},"cells_cut":0,"cells_raw":0,"read":"whole","date_system":"1900"}

{"sheet":"BasicData","index":0,"n_rows":71,"n_cols":18,"rows_kept":71,"cut":false,"hidden":false,"merged":[]}
["Basic Data (electricity tariffs and efficiency, exchange rates, inflation projections, labor costs, water production and losses)"]
["Основні дані (тариф на електроенергію та енергоефективність, курс обміну валюти, прогнозування інфляції, витрат на працю, виробництво води та втрати)"]
[]
["Key figures/Ключові цифри",null,"Note/Примітка"]
["CVK total 2017 revenue from water sales (UAH)\nЗагальний дохід ЧВК в 2017 році від реалізації води ",{"$f":"5223000*12","v":62676000},"confirmed\nПідтверджений"]
["USD/UAH exchange rate\nКурс обміну валюти доллар США/гривня",26.887,"mid-market exchange rate of 1st Nov 2017 (www.xe.com)\nсередньоринковий курс обміну валюти на 01.11.2017 (www.xe.com)"]
["CVK total 2017 budget for maintenance and repair of water supply network - material only (UAH)\nЗагальний бюджет ЧВК в 2017 році на технічне обслуговування та ремонт водопостачальної мережі  - лише матеріали (грн)",1334338,"check with Gennadii and chief accountant and O. Nych\nперевірити із Геннадієм та головним бухгалтером і О. Нич"]
["Total water production 2016 (m3)\nЗагальне виробництво води в 2016 році (м3)",{"$f":"WaterBalance!$F$47","v":28236765},null,null,null,null,"Electricity Tariff (September 2017, excluding VAT)\nТариф на електроенергію (вересень 2017, без ПДВ)"]
{"$rows_left_out":64}
{"sheet":"WaterBalance","index":1,"n_rows":67,"n_cols":19,"rows_kept":67,"cut":false,"hidden":false,"merged":[[3,4,3,5],[3,6,3,7],[1,0,1,7],[0,0,0,2],[54,8,55,18]]}
["CVK Water Balance 2017 and 2022\nВодний баланс ЧВК 2017 та 2022"]
["Note: The figures in this water balance are based on thorough and extensive, month-long investigations undergone by CVK in close collaboration with technical assistance consultant. They reflect CVKs best estimate of actual current (2017) water losses and may deviate from past reports submitted to the Regulator or City Council. Due to the lack of water meters or of sufficiently accurate and functioning water meters, some of the figures had to based on estimations and shall be verified, once new meters have been procured under this business plan's investment plan. All estimations were done by professional engineers and consultants to their best ability and knowledge.\nПримітка: Всі дані представленого Водного балансу ґрунтуються на ретельному та комплексному дослідженні, яке проводилось протягом місяця робітниками ЧВК при технічній підтримці консультанта. Вони надають найкращу оцінку фактичних поточних (2017) втрат води та можуть відрізнятися від даних, які містилася в минулих звітах, які подавалися до регулятора чи міської ради. Через брак лічильників або їх недостатньо точні показники та загалом роботу, по деяким даним виявилося необхідними робити припущення, тож вони потребують перевірки відразу, як нові лічильники будуть придбані в рамках інвестиційного плану цього бізнес-плану. Всі оцінки були зроблені професійними інженерами та консультантами виходячи з їх найкращих здібностей та знань."]
[]
[null,null,null,null,2017,null,2022]
["Production & Throughput\nВиробництво та пропускна здатність","Demand\nПопит","Loss\nВтрати","Technical use\nТехнологічні потреби","m3/day\nм3/день","m3/year\nм3/рік","m3/day\nм3/день","m3/year\nм3/рік"]
["PROD Mytkiv\nВиробництво Митків",null,null,null,64855,{"$f":"E6*365","v":23672075},43790,{"$f":"G6*365","v":15983350}]
["OUT Mytkiv PS\nВихід Митків НС",null,null,null,64855,{"$f":"E7*365","v":23672075},43790,{"$f":"G7*365","v":15983350}]
[null,null,"Скидання надлишків Митків-Вікно",null,4540,1657100,0,0]
{"$rows_left_out":60}
{"sheet":"Workforce","index":2,"n_rows":56,"n_cols":11,"rows_kept":56,"cut":false,"hidden":false,"merged":[[55,0,55,3]]}
["CVK Workforce Analysis\nАналіз складу персоналу ЧВК"]
["Status: 31 May 2017\nСтаном на 31.05.2017"]
[null,null,null,"TOTAL CVK\nЗАГАЛОМ ЧВК",null,null,"WATER BUSINESS\nВОДОПОСТАЧАННЯ",null,null,"WASTEWATER BUSINESS\nВОДОВІДВЕДЕННЯ"]
[null,"Factor (water/ww)\nФактор\n(ВП/ВВ)","actual\nфактично","scheduled\nзгідно штатного розкладу","vacancies\nвакансії","actual\nфактично","scheduled\nзгідно штатного розкладу","vacancies\nвакансії","actual\nфактично","scheduled\nзгідно штатного розкладу","vacancies\nвакансії"]
[]
["Director\nНачальник",0.7,1,1,{"$f":"D6-C6","v":0},{"$f":"C6*$B6","v":0.7},{"$f":"D6*$B6","v":0.7},{"$f":"G6-F6","v":0},{"$f":"(B6-1)*C6*-1","v":0.30000000000000004},{"$f":"($B6-1)*D6*-1","v":0.30000000000000004},{"$f":"J6-I6","v":0}]
["1st Deputy Director\n1-ий заступник начальника",0.7,1,1,{"$f":"D7-C7","v":0},{"$f":"C7*$B7","v":0.7},{"$f":"D7*$B7","v":0.7},{"$f":"G7-F7","v":0},{"$f":"(B7-1)*$C7*-1","v":0.30000000000000004},{"$f":"($B7-1)*D7*-1","v":0.30000000000000004},{"$f":"J7-I7","v":0}]
["Deputy Director\nЗаступник начальника",0.7,1,1,0,0.7,0.7,0,0.30000000000000004,0.30000000000000004,0]
{"$rows_left_out":49}
{"sheet":"IT","index":3,"n_rows":144,"n_cols":17,"rows_kept":144,"cut":false,"hidden":false,"merged":[[3,3,3,4],[3,6,3,10],[3,12,3,16],[0,0,0,2]]}
["CVK Procurement plan for IT equipment with costs allocated proportionally (70%) to water tariff\nПлан закупівель ІТ-обладнання для ЧВК із витратами пропорційно (70%) віднесеними до тарифу на централізоване водопостачання"]
[]
[]
["IT Procurement Plan","План закупівель ІТ-обладнання",null,"Factors\nФактори",null,null,"Quantities\nКількість",null,null,null,null,null,"Quantities (Water portion)\nКількість (частина водопостачання)"]
[null,null,null,"Water\nВП","WW\nВВ",null,null,null,null,null,null,null,2018,2019,2020,2021,2022]
["Hardware procurement","Закупівля обладнання"]
["Key Management Positions (Laptops)","Ключові керівні посади (ноутбуки)"]
["1st Deputy Director - Adminsitration","1-ий заступник начальника - з адміністративних питань ",null,0.7,0.3,null,1,null,null,null,null,null,{"$f":"$D8*G8","v":0.7},{"$f":"$D8*H8","v":0},0,0,0]
{"$rows_left_out":137}
{"sheet":"Training","index":4,"n_rows":17,"n_cols":3,"rows_kept":17,"cut":false,"hidden":false,"merged":[]}
[null,"CVK Calculation of Required Annual Training Budget"]
[null,"Розрахунок ЧВК бюджету для необхідних щорічних заходів з навчання"]
[null,"Total staff (water)\nВсього персоналу (водопостачання)",{"$f":"Workforce!F49","v":473.79999999999995}]
[null,"Training days/year/person\nДнів навчання/рік/людина",3]
[null,"Total training days/year\nВсього днів навчання/рік",{"$f":"C3*C4","v":1421.3999999999999}]
[]
[null,"Participants/course\nУчасники/курс",5]
[null,"Total course days\nВсього днів курсу",{"$f":"C5/C7","v":284.27999999999997}]
{"$rows_left_out":10}
{"sheet":"CVKInvest","index":5,"n_rows":174,"n_cols":15,"rows_kept":174,"cut":false,"hidden":false,"merged":[[94,2,94,6],[1,0,1,8],[90,0,90,10]]}
["Depreciation of Other CVK Investments 2018-2022\nАмортизація інших інвестицій ЧВК 2018-2022"]
["Note 1: Some investment items serve both CVK businesses, water and wastewater. In that case only 70% of costs are accounted for in the water tariff and 30% have to be included in the wastewater tariff)\nПримітка 1: Деякі інвестиційні статті задіяні для обох послуг, які надає ЧВК, а саме централізоване водопостачання та водовідведення. В таких випадках, лише 70% витрат входять до тарифу на централізоване водопостачання, а 30% має включатися в тариф на послуги водовідведення."]
["Note 2: For simplicity reasons, depreciation of each item is assumed to start in the middle of the year.\nПримітка 2: З міркувань простоти припускається, що амортизація кожного активу розпочнеться в середині року."]
[]
["CVK Other capital investment measures\nІнші заходи ЧВК з капітального інвестування ","Total (UAH)\nВсього (грн)",2018,2019,2020,2021,2022,"Factor for water tariff\nФактор для тарифу на водопостачання",2018,2019,2020,2021,2022,"TOTAL\nВСЬОГО","Dep (y)\nАморт (р)"]
[]
["5-year asset accounting life\nактив із 5-річним строком амортизації "]
["Technical measuring equipment\nОбладнання для проведення технічних вимірювань",5050700,2013700,1461600,1575400,0,0,1,{"$f":"C8*$H$8","v":2013700},1461600,1575400,0,0,{"$f":"SUM(I8:M8)","v":5050700},5]
{"$rows_left_out":167}
{"sheet":"KfWProject","index":6,"n_rows":168,"n_cols":66,"rows_kept":168,"cut":false,"hidden":false,"merged":[[166,0,166,3],[167,0,167,3],[160,0,160,3],[161,0,161,3],[162,0,162,3],[164,0,164,3],[165,0,165,3],[124,0,124,4],[133,0,133,6],[142,0,142,2],[150,0,150,3],[159,0,159,3],[108,54,108,55],[106,54,106,55],[112,60,112,62],[106,0,106,3],[114,0,114,3],[0,0,0,14],[1,0,1,7],[2,0,2,8],[4,2,4,8],[6,47,6,48],[5,62,5,63],[6,38,6,39],[6,3,6,4],[6,17,6,18],[6,10,6,11],[6,24,6,25],[6,31,6,32]]}
["KfW project implementation schedule projection, loan disbursement, interest, commitment charge, capital asset values\nПлан-графік реалізації проекту KfW, виплата кредиту, відсотки, комісія за резервування, капітальна вартість активу"]
["Status of construction schedule: September 2017\nСтан графіка будівництва: вересень 2017",null,null,null,null,null,null,null,null,null,null,null,"Sign - підписання; Build - будівництво; Hand-over - передача; Liability - гарантійний термін"]
["Note: Construction schedule projection needs to be updated regularly to reflect actual project progress\nПримітка: План-графік будівництва потребує регулярного оновлення для відображення в ньому поточного прогресу по проекту."]
[]
[null,null,"KfW Project Implementation Schedule Project\nПлан-графік реалізації проекту KfW"]
[null,null,"Contract 1\nКонтракт 1",null,null,null,null,null,null,null,null,null,null,null,null,null,null,null,null,null,null,null,null,null,null,null,null,null,null,null,null,null,null,null,null,null,null,"Contract 2\nКонтракт 2",null,null,null,null,null,null,null,null,"Contract 3\nКонтракт 3",null,null,null,null,null,null,null,null,null,17000000,null,2.5000000000000001E-3,0.04,null,null,"Payment schedule\nГрафік виплат"]
[null,null,"Object #1\nОб'єкт №1","Disbursement\nВиплата",null,"INT during construction\nВідсоток під час будівництва","INT after construction\nВідсоток після будівництва","CAV\nКВА","Depreciation\nАмотризація","Object #2\nОб'єкт №2","Disbursement\nВиплата",null,"INT during construction\nВідсоток під час будівництва","INT after construction\nВідсоток після будівництва","CAV\nКВА","Depreciation\nАмотризація","Object #3\nОб'єкт №3","Disbursement\nВиплата",null,"INT during construction\nВідсоток під час будівництва","INT after construction\nВідсоток після будівництва","CAV\nКВА","Depreciation\nАмотризація","Object #4\nОб'єкт №4","Disbursement\nВиплата",null,"INT during construction\nВідсоток під час будівництва","INT after construction\nВідсоток після будівництва","CAV\nКВА","Depreciation\nАмотризація","Object #5\nОб'єкт №5","Disbursement\nВиплата",null,"INT during construction\nВідсоток під час будівництва","INT after construction\nВідсоток після будівництва","CAV\nКВА","Depreciation\nАмотризація","Object #6\nОб'єкт №6","Disbursement\nВиплата",null,"INT during construction\nВідсоток під час будівництва","INT after construction\nВідсоток після будівництва","Actual work done\nФактично зроблених робіт","value of work done incl. interest during construction\nВартість зроблених робіт, включ. відсоток під час будівництва","CAV\nКВА","Depreciation\nАмотризація","Object #7\nОб'єкт №7","Disbursement\nВиплата",null,"INT during construction\nВідсоток під час будівництва","INT after construction\nВідсоток після будівництва","CAV\nКВА","Depreciation\nАмотризація",null,"Total payment to contractors\nЗагальна сума виплат підрядникам","Total sum disbursed from KfW\nЗагальна сума виплат від KfW","Undisbursed loan\nНевикористаний кредит","Disbursed loan cumulated\nВикористана частина кредиту","Commitment charge\nКомісія за резервування","Interest (2% to KfW + 2% to MoF) \nВідсоток (2% банку KfW + 2% Мінфін","Commitment charge (year)\nКомісія за резервування (рік)","Interest (year)\nВідсотки (рік)","Commitment charge payable to KfW \nКомісія за резервування, сплачена KfW","Interest payable to KfW & MoF \nКомісія за резервування, сплачена KfW та Мінфну","INT during construction (sum)\nВідсотки під час будівництва (сума)","INT after construction (sum) \nВідсотки після будівництва (сума)"]
[null,null,"Mytkiv\nМитків","%","EUR\nєвро","EUR\nєвро","EUR\nєвро","EUR\nєвро",15.5,"Vikno\nВікно","%","EUR\nєвро","EUR\nєвро","EUR\nєвро","EUR\nєвро",17.2,"Transmission\nВодогін","%","EUR\nєвро","EUR\nєвро","EUR\nєвро","EUR\nєвро",59.6,"Popov\nПопова","%","EUR\nєвро","EUR\nєвро","EUR\nєвро","EUR\nєвро",19.399999999999999,"Rohizna\nРогізна","%","EUR\nєвро","EUR\nєвро","EUR\nєвро","EUR\nєвро",18.2,"Network/ Zones\nМережа/Зони","%","EUR\nєвро","Interest on advance payment\nВідсотки за передоплатою","EUR\nєвро","%","EUR\nєвро","EUR\nєвро",45,"SCADA","%","EUR\nєвро","EUR\nєвро","EUR\nєвро","EUR\nєвро",10,null,"EUR\nєвро","EUR\nєвро","EUR\nєвро","EUR\nєвро","EUR\nєвро","EUR\nєвро","EUR\nєвро","EUR\nєвро","EUR\nєвро","EUR\nєвро","EUR\nєвро","EUR\nєвро"]
{"$rows_left_out":161}
{"sheet":"KfWInterest","index":7,"n_rows":17,"n_cols":9,"rows_kept":17,"cut":false,"hidden":false,"merged":[[0,0,0,8]]}
["Interest and commitment charge for KfW loan\nВідсотки та комісія за резервування кредиту KfW"]
[]
[null,null,null,2017,2018,2019,2020,2021,2022]
[null,"Interest \nВидсотки"]
[null,"Interest \nВидсотки","EUR\nєвро",{"$f":"LOOKUP(D3,KfWProject!$F$135:$F$140,KfWProject!$G$135:$G$140)","v":0},{"$f":"LOOKUP(E3,KfWProject!$F$135:$F$140,KfWProject!$G$135:$G$140)","v":0},{"$f":"LOOKUP(F3,KfWProject!$F$135:$F$140,KfWProject!$G$135:$G$140)","v":56109.705703703701},{"$f":"LOOKUP(G3,KfWProject!$F$135:$F$140,KfWProject!$G$135:$G$140)","v":236681.09214814816},{"$f":"LOOKUP(H3,KfWProject!$F$135:$F$140,KfWProject!$G$135:$G$140)","v":593502.37714814814},{"$f":"LOOKUP(I3,KfWProject!$F$135:$F$140,KfWProject!$G$135:$G$140)","v":701549.67133333324}]
[null,"Interest at projected exchange rates\nВідсотки за прогнозованими курсами валют","UAH\nгрн",{"$f":"D5*BasicData!B41","v":0},{"$f":"E5*BasicData!C41","v":0},{"$f":"F5*BasicData!D41","v":1945452.2317408554},{"$f":"G5*BasicData!E41","v":9377450.2896277476},{"$f":"H5*BasicData!F41","v":27797487.953161221},{"$f":"I5*BasicData!G41","v":39500503.739544988}]
[null,"Interest at base year (2017) price levels\nВідсотки за базовим рівнем цін (2017р.)","UAH\nгрн",{"$f":"D6/BasicData!B33","v":0},{"$f":"E6/BasicData!C33","v":0},{"$f":"F6/BasicData!D33","v":1714579.7781619092},{"$f":"G6/BasicData!E33","v":7871048.6582814679},{"$f":"H6/BasicData!F33","v":22221024.499218702},{"$f":"I6/BasicData!G33","v":30072661.269553568}]
[]
{"$rows_left_out":10}
{"sheet":"BP","index":8,"n_rows":698,"n_cols":14,"rows_kept":698,"cut":false,"hidden":false,"merged":[]}
["Примітка: для коректного відображення всіх цифр в колонці А необхідно обрати будь-яку комірку на цьому листі та натиснути на клавіатурі \"Ctrl+Alt+F9\""]
["Note: To display all numbers in column A correctly, single-click on any cell in this sheet and then press \"Ctrl+Alt+F9\""]
["Chernivtsivodokanal Business Plan 2018-2022",null,"Бізнес-план КП \"Чернівціводоканал\" на 2018-2022 рр."]
[]
["No","Activity","Захід","Notes","Примітки","Unit","од. вимірювання",2016,2017,2018,2019,2020,2021,2022]
[]
["A","Operations & Water Loss Reduction Plan","План операційної діяльність та скорочення втрат води"]
[]
{"$rows_left_out":691}
{"sheet":"Assets","index":9,"n_rows":179,"n_cols":12,"rows_kept":179,"cut":false,"hidden":false,"merged":[[0,0,0,7],[108,3,108,5]]}
["Asset values, Depreciation and Return on Capital\nВартість активу, амортизація та дохід на капітал"]
[]
[null,null,null,null,null,null,2017,2018,2019,2020,2021,2022]
[null,null,null,"Inflation factor (Ukraine)\nФактор інфляції (Україна)","%",null,1,{"$f":"BasicData!C33","v":1.0754999999999999},{"$f":"BasicData!D33","v":1.1346524999999998},{"$f":"BasicData!E33","v":1.1913851249999998},{"$f":"BasicData!F33","v":1.2509543812499999},{"$f":"BasicData!G33","v":1.3135021003125}]
[null,null,null,"Asset values and depreciation\nВартість активу та амортизація "]
[null,null,null,"Existing assets\nІснуючі активи "]
[null,null,null,"Historic cost convention\nМетод первісної вартості"]
[null,null,null,"Asset value at start of year (2017 off model calculation)\nВартість активу на початок року (2017; розрахунок проводився окремо)","UAH\nгрн",null,28848431.289999899,{"$f":"G11","v":30414562.536999963},{"$f":"H11","v":27129901.948999964},24355381.465999965,22244119.301999964,20487830.695999965]
{"$rows_left_out":172}
{"sheet":"Tariffs","index":10,"n_rows":109,"n_cols":10,"rows_kept":109,"cut":false,"hidden":false,"merged":[[0,0,0,3]]}
["Tariff Analysis and Adjustment Plan 2018-2022\nАналіз тарифу та план коригування тарифу 2018-2022"]
[]
[null,null,null,null,2017,2018,2019,2020,2021,2022]
[null,"Option 1: Cost plus model with costs projected in accordance with inflation projections and using historic cost convention\nВаріант 1: Модель \"витрати плюс\" із прогнозованими витратами згідно з прогнозами щодо інфляції та використанням первісної вартості"]
[null,"Revenue requirement\nВимоги до доходу","UAH\nгрн",null,{"$f":"E6+E11+E15+E18","v":99624976.657957792},{"$f":"F6+F11+F15+F18","v":132304929.85276529},163709574.79173654,133235683.79848699,140940924.7471914,151550133.35614404]
[null,"Operational costs\nОпераційні витрати ","UAH\nгрн",null,{"$f":"SUM(E7:E10)","v":99624976.657957792},{"$f":"SUM(F7:F10)","v":100309466.55633114},109226150.67902766,105576096.51684852,96183383.878803596,98249079.336872876]
[null," - Energy\n - Електроенергія","UAH\nгрн",null,{"$f":"BP!I694","v":49846533.503715329},{"$f":"BP!J694","v":48080669.760758594},{"$f":"BP!K694","v":50725106.597600318},{"$f":"BP!L694","v":45671647.688975476},{"$f":"BP!M694","v":34016764.223937728},{"$f":"BP!N694","v":32084433.026420951}]
[null," - Other consumables and materials\n - Інші матеріальні витрати\n","UAH\nгрн",null,{"$f":"BP!I695","v":10963898.95145},{"$f":"BP!J695","v":13402439.733820712},{"$f":"BP!K695","v":14187041.927746499},{"$f":"BP!L695","v":14368799.31573269},{"$f":"BP!M695","v":14910177.357486509},{"$f":"BP!N695","v":16010356.529534977}]
{"$rows_left_out":102}
{"sheet":"P&L","index":11,"n_rows":123,"n_cols":10,"rows_kept":123,"cut":false,"hidden":false,"merged":[[0,0,0,2]]}
["CVK Profit and Loss Analysis 2018-2022\nАналіз прибутку та збитків ЧВК 2018-2022"]
[]
[null,null,null,null,2017,2018,2019,2020,2021,2022]
[null,"Option 1: Cost plus model with costs projected in accordance with inflation projections and using historic cost convention\nВаріант 1: Модель \"витрати плюс\" із прогнозованими витратами згідно з прогнозами щодо інфляції та використанням первісної вартості"]
[null,"Option 1a - Cost plus tariffs with adjustment for NRW norms\nВаріант 1а - Тарифи за принципом \"витрати плюс\" із коригуванням для норм БДВ"]
[null,"Income\nДохід"]
[null,"Income from water sales\nДохід від реалізації послуг централізованого водопостачання","UAH\nгрн",null,null,{"$f":"Tariffs!F29*Tariffs!F22","v":73513971.308299005},{"$f":"Tariffs!G29*Tariffs!G22","v":100413934.40060726},{"$f":"Tariffs!H29*Tariffs!H22","v":97715793.19389604},{"$f":"Tariffs!I29*Tariffs!I22","v":118634061.79528549},{"$f":"Tariffs!J29*Tariffs!J22","v":130266524.28364767}]
[null,"Expenditure\nВитрати"]
{"$rows_left_out":116}
{"sheet":"CashFlow","index":12,"n_rows":108,"n_cols":10,"rows_kept":108,"cut":false,"hidden":false,"merged":[[0,0,0,3],[1,0,1,1],[52,0,52,1],[53,0,53,1]]}
["CVK Cash Flow Projections (real cost basis)\nПрогнозування грошового потоку ЧВК (на основі витрат без урахування інфляції)"]
["Not adjusted for inflation\nБез урахування інфляції"]
[null,null,null,null,2017,2018,2019,2020,2021,2022]
[null,"Option 1: Cost plus model with costs projected in accordance with inflation projections and using historic cost convention\nВаріант 1: Модель \"витрати плюс\" із прогнозованими витратами згідно з прогнозами щодо інфляції та використанням первісної вартості"]
[null,"Option 1a - Cost plus tariffs with adjustment for NRW norms\nВаріант 1а - Тарифи за принципом \"витрати плюс\" із коригуванням для норм БДВ"]
[]
[null,"Net income\nЧистий дохід","UAH\nгрн",null,{"$f":"CashFlow!E59/BasicData!B$33","v":0},{"$f":"CashFlow!F59/BasicData!C$33","v":-33585744.18769145},{"$f":"CashFlow!G59/BasicData!D$33","v":-19007883.913601834},{"$f":"CashFlow!H59/BasicData!E$33","v":-32406922.680176839},{"$f":"CashFlow!I59/BasicData!F$33","v":-29231718.503901582},{"$f":"CashFlow!J59/BasicData!G$33","v":-30631980.94423287}]
[null,"Add depreciation\nПлюс амортизація","UAH\nгрн",null,{"$f":"CashFlow!E60/BasicData!B$33","v":0},{"$f":"CashFlow!F60/BasicData!C$33","v":4231710.8946635053},{"$f":"CashFlow!G60/BasicData!D$33","v":8737220.9705288522},{"$f":"CashFlow!H60/BasicData!E$33","v":17541044.854406651},{"$f":"CashFlow!I60/BasicData!F$33","v":24873390.078583796},{"$f":"CashFlow!J60/BasicData!G$33","v":24926283.836118229}]
{"$rows_left_out":101}
{"sheet":"Graphs","index":13,"n_rows":202,"n_cols":7,"rows_kept":202,"cut":false,"hidden":false,"merged":[]}
["Figures and Graphs\nЦифри та графіки"]
[]
[]
["Projected tariffs using cost plus method",2018,2019,2020,2021,2022]
["1b Projected tariffs without adjustment for NRW norms",{"$f":"Tariffs!F48","v":13.596135203049116},{"$f":"Tariffs!G48","v":14.683555984051651},{"$f":"Tariffs!H48","v":11.147120013884972},{"$f":"Tariffs!I48","v":11.108074498470632},{"$f":"Tariffs!J48","v":11.251684224009422}]
["1a Projected tariffs with adjustment for NRW norms",{"$f":"Tariffs!F30","v":7.5545627387656724},{"$f":"Tariffs!G30","v":9.0063982465650554},{"$f":"Tariffs!H30","v":8.1753599556089256},{"$f":"Tariffs!I30","v":9.3499882936198784},{"$f":"Tariffs!J30","v":9.6715044964982653}]
[null,{"$f":"B5-B6","v":6.0415724642834432},{"$f":"C5-C6","v":5.6771577374865956},2.9717600582760468,1.7580862048507537,1.5801797275111564]
[]
{"$rows_left_out":194}